Target
Hexokinase-4
Ligand
BDBM50394682
Substrate
Meas. Tech.
ChEMBL_858378 (CHEMBL2168593)
EC50
114±n/a nM
Citation
 Pfefferkorn, JAGuzman-Perez, ALitchfield, JAiello, RTreadway, JLPettersen, JMinich, MLFilipski, KJJones, CSTu, MAspnes, GRisley, HBian, JStevens, BDBourassa, PD'Aquila, TBaker, LBarucci, NRobertson, ASBourbonais, FDerksen, DRMacdougall, MCabrera, OChen, JLapworth, ALLandro, JAZavadoski, WJAtkinson, KHaddish-Berhane, NTan, BYao, LKosa, REVarma, MVFeng, BDuignan, DBEl-Kattan, AMurdande, SLiu, SAmmirati, MKnafels, JDasilva-Jardine, PSweet, LLiras, SRolph, TP Discovery of (S)-6-(3-cyclopentyl-2-(4-(trifluoromethyl)-1H-imidazol-1-yl)propanamido)nicotinic acid as a hepatoselective glucokinase activator clinical candidate for treating type 2 diabetes mellitus. J Med Chem 55:1318-33 (2012)  
Target
Name:
Hexokinase-4
Synonyms:
GCK Glucokinase (GK) HK IV HXK4_HUMAN Hexokinase-D
Type:
Enzyme
Mol. Mass.:
52175.81
Organism:
Homo sapiens (Human)
Description:
P35557
Residue:
465
  
Inhibitor
Name:
BDBM50394682
Synonyms:
CHEMBL2165619
Type:
Small organic molecule
Emp. Form.:
C18H21F3N4O
Mol. Mass.:
366.3807
SMILES:
Cc1ccc(NC(=O)[C@H](CC2CCCC2)n2cnc(c2)C(F)(F)F)nc1
: