Target
Serine/threonine-protein kinase mTOR
Ligand
BDBM50394838
Substrate
Meas. Tech.
ChEMBL_860331 (CHEMBL2169664)
IC50
>10000±n/a nM
Citation
 Smith, ALD'Angelo, NDBo, YYBooker, SKCee, VJHerberich, BHong, FTJackson, CLLanman, BALiu, LNishimura, NPettus, LHReed, ABTadesse, STamayo, NAWurz, RPYang, KAndrews, KLWhittington, DAMcCarter, JDMiguel, TSZalameda, LJiang, JSubramanian, RMullady, ELCaenepeel, SFreeman, DJWang, LZhang, NWu, THughes, PENorman, MH Structure-based design of a novel series of potent, selective inhibitors of the class I phosphatidylinositol 3-kinases. J Med Chem 55:5188-219 (2012)  
Target
Name:
Serine/threonine-protein kinase mTOR
Synonyms:
FK506-binding protein 12-rapamycin complex-associated protein 1 FRAP FRAP1 MTOR Mammalian Target of Rapamycin (mTOR) RAFT1 Rapamycin and FKBP12 target 1 Serine/threonine-protein kinase (mTOR) | mTORC2
Type:
Rapamycin target protein
Mol. Mass.:
288917.12
Organism:
Homo sapiens (Human)
Description:
P42345
Residue:
2549
  
Inhibitor
Name:
BDBM50394838
Synonyms:
CHEMBL2165007 | US8772480, 141
Type:
Small organic molecule
Emp. Form.:
C23H23N7O3S
Mol. Mass.:
477.539
SMILES:
COc1ccc(Nc2ncc(Cc3ccc(cc3)S(C)(=O)=O)cc2-c2nc(C)nc(N)n2)cn1
: