Target
Phosphatidylinositol 4,5-bisphosphate 3-kinase catalytic subunit alpha isoform
Ligand
BDBM50394860
Substrate
Meas. Tech.
ChEMBL_860488 (CHEMBL2166657)
Ki
5±n/a nM
Citation
 Smith, ALD'Angelo, NDBo, YYBooker, SKCee, VJHerberich, BHong, FTJackson, CLLanman, BALiu, LNishimura, NPettus, LHReed, ABTadesse, STamayo, NAWurz, RPYang, KAndrews, KLWhittington, DAMcCarter, JDMiguel, TSZalameda, LJiang, JSubramanian, RMullady, ELCaenepeel, SFreeman, DJWang, LZhang, NWu, THughes, PENorman, MH Structure-based design of a novel series of potent, selective inhibitors of the class I phosphatidylinositol 3-kinases. J Med Chem 55:5188-219 (2012)  
Target
Name:
Phosphatidylinositol 4,5-bisphosphate 3-kinase catalytic subunit alpha isoform
Synonyms:
P42336 PI3-kinase subunit p110-alpha PIK3CA Phosphatidylinositol 3-kinase alpha (PI3Kalpha) Phosphatidylinositol 4,5-bisphosphate 3-kinase (PI3K) Phosphatidylinositol 4,5-bisphosphate 3-kinase catalytic subunit alpha (PI3Kalpha) Phosphatidylinositol 4,5-bisphosphate 3-kinase catalytic subunit alpha isoform (PI3-Ka) Phosphatidylinositol 4,5-bisphosphate 3-kinase catalytic subunit alpha isoform (PI3K p110alpha) Phosphatidylinositol 4,5-bisphosphate 3-kinase catalytic subunit alpha isoform (PI3K-alpha) Phosphatidylinositol 4,5-bisphosphate 3-kinase catalytic subunit alpha isoform (PI3Kalpha p110alpha) Phosphatidylinositol 4,5-bisphosphate 3-kinase catalytic subunit alpha isoform (PIK3CA) Phosphatidylinositol-4,5-bisphosphate 3-kinase catalytic subunit alpha isoform Phosphoinositide 3-Kinase (PI3K), alpha Chain A Phosphoinositide 3-kinases (PI3K) PtdIns-3-kinase p110 | p110 alpha
Type:
Enzyme Subunit
Mol. Mass.:
124294.87
Organism:
Homo sapiens (Human)
Description:
P42336
Residue:
1068
  
Inhibitor
Name:
BDBM50394860
Synonyms:
CHEMBL2165030 | US8772480, 256
Type:
Small organic molecule
Emp. Form.:
C20H21N7O2
Mol. Mass.:
391.4264
SMILES:
COc1ccc(Nc2ncc(cc2-c2nc(C)nc(N)n2)C2=CCOCC2)cn1
: