Target
Cholesteryl ester transfer protein
Ligand
BDBM50392500
Substrate
Meas. Tech.
ChEMBL_860698 (CHEMBL2168015)
IC50
72000±n/a nM
Citation
 Harikrishnan, LSFinlay, HJQiao, JXKamau, MGJiang, JWang, TCLi, JCooper, CBPoss, MAAdam, LPTaylor, DSChen, AYYin, XSleph, PGYang, RZSitkoff, DFGalella, MANirschl, DSVan Kirk, KMiller, AVHuang, CSChang, MChen, XQSalvati, MEWexler, RRLawrence, RM Diphenylpyridylethanamine (DPPE) derivatives as cholesteryl ester transfer protein (CETP) inhibitors. J Med Chem 55:6162-75 (2012)  
Target
Name:
Cholesteryl ester transfer protein
Synonyms:
CETP Cholesteryl ester transfer protein (CETP) | Lipid transfer protein I
Type:
Enzyme
Mol. Mass.:
54751.53
Organism:
Homo sapiens (Human)
Description:
P11597
Residue:
493
  
Inhibitor
Name:
BDBM50392500
Synonyms:
CHEMBL2152153
Type:
Small organic molecule
Emp. Form.:
C26H24ClF4N3O
Mol. Mass.:
505.935
SMILES:
Fc1cc(cc(c1)[C@@](Cc1ccccc1)(NC(=O)NC1CCCC1)c1ccc(Cl)cn1)C(F)(F)F
: