Target
Cholesteryl ester transfer protein
Ligand
BDBM50394942
Substrate
Meas. Tech.
ChEMBL_860684 (CHEMBL2168001)
IC50
31±n/a nM
Citation
 Harikrishnan, LSFinlay, HJQiao, JXKamau, MGJiang, JWang, TCLi, JCooper, CBPoss, MAAdam, LPTaylor, DSChen, AYYin, XSleph, PGYang, RZSitkoff, DFGalella, MANirschl, DSVan Kirk, KMiller, AVHuang, CSChang, MChen, XQSalvati, MEWexler, RRLawrence, RM Diphenylpyridylethanamine (DPPE) derivatives as cholesteryl ester transfer protein (CETP) inhibitors. J Med Chem 55:6162-75 (2012)  
Target
Name:
Cholesteryl ester transfer protein
Synonyms:
CETP Cholesteryl ester transfer protein (CETP) | Lipid transfer protein I
Type:
Enzyme
Mol. Mass.:
54751.53
Organism:
Homo sapiens (Human)
Description:
P11597
Residue:
493
  
Inhibitor
Name:
BDBM50394942
Synonyms:
CHEMBL2165718
Type:
Small organic molecule
Emp. Form.:
C26H24ClF4N3O
Mol. Mass.:
505.935
SMILES:
Fc1cc(cc(c1)C(Cc1ccccc1)(NC(=O)NC1CCCC1)c1ccc(Cl)nc1)C(F)(F)F
: