Target
Lysine-specific demethylase 6B
Ligand
BDBM50395077
Substrate
Meas. Tech.
ChEMBL_859439 (CHEMBL2167517)
IC50
>100000±n/a nM
Citation
 Rose, NRWoon, ECTumber, AWalport, LJChowdhury, RLi, XSKing, ONLejeune, CNg, SSKrojer, TChan, MCRydzik, AMHopkinson, RJChe, KHDaniel, MStrain-Damerell, CGileadi, CKochan, GLeung, IKDunford, JYeoh, KKRatcliffe, PJBurgess-Brown, Nvon Delft, FMuller, SMarsden, BBrennan, PEMcDonough, MAOppermann, UKlose, RJSchofield, CJKawamura, A Plant growth regulator daminozide is a selective inhibitor of human KDM2/7 histone demethylases. J Med Chem 55:6639-43 (2012)  
Target
Name:
Lysine-specific demethylase 6B
Synonyms:
JMJD3 Jumonji domain-containing protein 3 KDM6B_HUMAN Lysine demethylase 6B Lysine-specific demethylase 6B (KDM6B(JMJD3)) | Lysine-specific demethylase 6B (KDM6B)
Type:
Protein
Mol. Mass.:
176672.55
Organism:
Homo sapiens (Human)
Description:
O15054
Residue:
1643
  
Inhibitor
Name:
BDBM50395077
Synonyms:
CHEMBL2164250
Type:
Small organic molecule
Emp. Form.:
C8H18N4O2
Mol. Mass.:
202.2541
SMILES:
CN(C)NC(=O)CCC(=O)NN(C)C
: