Target
Mu-type opioid receptor
Ligand
BDBM50346952
Substrate
Meas. Tech.
ChEMBL_859458 (CHEMBL2167536)
Ki
0.22±n/a nM
Citation
 Majumdar, SSubrath, JLe Rouzic, VPolikar, LBurgman, MNagakura, KOcampo, JHaselton, NPasternak, ARGrinnell, SPan, YXPasternak, GW Synthesis and evaluation of aryl-naloxamide opiate analgesics targeting truncated exon 11-associatedµ opioid receptor (MOR-1) splice variants. J Med Chem 55:6352-62 (2012)  
Target
Name:
Mu-type opioid receptor
Synonyms:
M-OR-1 Mor OPRM_MOUSE Oprm | Oprm1
Type:
Enzyme Catalytic Domain
Mol. Mass.:
44431.62
Organism:
MOUSE
Description:
OPIATE Mu OPRM1 MOUSE::P42866
Residue:
398
  
Inhibitor
Name:
BDBM50346952
Synonyms:
CHEMBL1795712 | CHEMBL1795715
Type:
Small organic molecule
Emp. Form.:
C26H27IN2O4
Mol. Mass.:
558.4081
SMILES:
Oc1ccc2C[C@H]3N(CC=C)CC[C@@]45[C@@H](Oc1c24)[C@@H](CC[C@@]35O)NC(=O)c1cccc(I)c1
: