Target
Adenosine receptor A3
Ligand
BDBM50395122
Substrate
Meas. Tech.
ChEMBL_859652 (CHEMBL2168889)
Ki
450±n/a nM
Citation
 Korboukh, IHull-Ryde, EARittiner, JERandhawa, ASColeman, JFitzpatrick, BJSetola, VJanzen, WPFrye, SVZylka, MJJin, J Orally active adenosine A(1) receptor agonists with antinociceptive effects in mice. J Med Chem 55:6467-77 (2012)  
Target
Name:
Adenosine receptor A3
Synonyms:
A3 adenosine receptor (hA3) ADORA3 | Adenosine A3 receptor (A3AR)
Type:
G Protein-Coupled Receptor (GPCR)
Mol. Mass.:
36197.32
Organism:
Homo sapiens (Human)
Description:
P0DMS8
Residue:
318
  
Inhibitor
Name:
BDBM50395122
Synonyms:
CHEMBL2163561
Type:
Small organic molecule
Emp. Form.:
C17H25ClN5O7P
Mol. Mass.:
477.836
SMILES:
COP(=O)(OC)OC[C@H]1O[C@H]([C@H](O)[C@@H]1O)n1cnc2c(NC3CCCC3)nc(Cl)nc12
: