Target
HTH-type transcriptional regulator EthR
Ligand
BDBM50395186
Substrate
Meas. Tech.
ChEMBL_859797 (CHEMBL2169625)
EC50
>10000±n/a nM
Citation
 Flipo, MWilland, NLecat-Guillet, NHounsou, CDesroses, MLeroux, FLens, ZVilleret, VWohlkönig, AWintjens, RChristophe, TKyoung Jeon, HLocht, CBrodin, PBaulard, ARDéprez, B Discovery of novel N-phenylphenoxyacetamide derivatives as EthR inhibitors and ethionamide boosters by combining high-throughput screening and synthesis. J Med Chem 55:6391-402 (2012)  
Target
Name:
HTH-type transcriptional regulator EthR
Synonyms:
ETHR_MYCTU Transcriptional repressor EthR (EthR) ethR
Type:
Protein
Mol. Mass.:
23751.94
Organism:
Mycobacterium tuberculosis
Description:
P9WMC1
Residue:
216
  
Inhibitor
Name:
BDBM50395186
Synonyms:
CHEMBL1612418
Type:
Small organic molecule
Emp. Form.:
C22H20N4O2
Mol. Mass.:
372.4198
SMILES:
Cc1ccc(cc1)-n1nc2ccc(NC(=O)COc3ccccc3C)cc2n1
: