Target
Histone acetyltransferase p300
Ligand
BDBM50395260
Substrate
Meas. Tech.
ChEMBL_860195 (CHEMBL2168935)
IC50
5000±n/a nM
Citation
 Mun, JJabbar, AADevi, NSYin, SWang, YTan, CCulver, DSnyder, JPVan Meir, EGGoodman, MM Design and in vitro activities of N-alkyl-N-[(8-R-2,2-dimethyl-2H-chromen-6-yl)methyl]heteroarylsulfonamides, novel, small-molecule hypoxia inducible factor-1 pathway inhibitors and anticancer agents. J Med Chem 55:6738-50 (2012)  
Target
Name:
Histone acetyltransferase p300
Synonyms:
EP300 HIF1A/p300/CREB-binding protein P300
Type:
Protein
Mol. Mass.:
264223.04
Organism:
Homo sapiens (Human)
Description:
Q09472
Residue:
2414
  
Inhibitor
Name:
BDBM50395260
Synonyms:
CHEMBL2163598
Type:
Small organic molecule
Emp. Form.:
C21H26N2O4S
Mol. Mass.:
402.507
SMILES:
COc1cc(CN(C(C)C)S(=O)(=O)c2ccccn2)cc2C=CC(C)(C)Oc12
: