Target
Sodium channel protein type 9 subunit alpha
Ligand
BDBM50020712
Substrate
Meas. Tech.
ChEMBL_860772 (CHEMBL2168492)
IC50
1000±n/a nM
Citation
 Macsari, IBesidski, YCsjernyik, GNilsson, LISandberg, LYngve, UAhlin, KBueters, TEriksson, ABLund, PEVenyike, EOerther, SHygge Blakeman, KLuo, LArvidsson, PI 3-Oxoisoindoline-1-carboxamides: potent, state-dependent blockers of voltage-gated sodium channel Na(V)1.7 with efficacy in rat pain models. J Med Chem 55:6866-80 (2012)  
Target
Name:
Sodium channel protein type 9 subunit alpha
Synonyms:
NENA Peripheral sodium channel 1 SCN9A_HUMAN Voltage-gated sodium channel subunit Nav1.7 hNE-Na
Type:
Protein
Mol. Mass.:
226375.97
Organism:
Homo sapiens (Human)
Description:
Q15858
Residue:
1988
  
Inhibitor
Name:
BDBM50020712
Synonyms:
10,11-dihydro-5-(gamma-dimethylaminopropylidene)-5H-dibenzo(a,d)cycloheptene 3-(10,11-dihydro-5H-dibenzo(a,d)cyclohepten-5-ylidene)-N,N-dimethyl-1-propanamine 3-(10,11-dihydro-5H-dibenzo[a,d]cyclohepten-5-ylidene)-N,N-dimethylpropan-1-amine 5-(3-dimethylaminopropylidene)-10,11-dihydro-5H-dibenzo(a,d)cycloheptene AMITRIPTYLINE CHEMBL629
Type:
Small organic molecule
Emp. Form.:
C20H23N
Mol. Mass.:
277.4033
SMILES:
[#6]-[#7](-[#6])-[#6]-[#6]\[#6]=[#6]-1/c2ccccc2-[#6]-[#6]-c2ccccc-12
: