Target
Sodium channel protein type 9 subunit alpha
Ligand
BDBM50395332
Substrate
Meas. Tech.
ChEMBL_860772 (CHEMBL2168492)
IC50
49±n/a nM
Citation
 Macsari, IBesidski, YCsjernyik, GNilsson, LISandberg, LYngve, UAhlin, KBueters, TEriksson, ABLund, PEVenyike, EOerther, SHygge Blakeman, KLuo, LArvidsson, PI 3-Oxoisoindoline-1-carboxamides: potent, state-dependent blockers of voltage-gated sodium channel Na(V)1.7 with efficacy in rat pain models. J Med Chem 55:6866-80 (2012)  
Target
Name:
Sodium channel protein type 9 subunit alpha
Synonyms:
NENA Peripheral sodium channel 1 SCN9A_HUMAN Voltage-gated sodium channel subunit Nav1.7 hNE-Na
Type:
Protein
Mol. Mass.:
226375.97
Organism:
Homo sapiens (Human)
Description:
Q15858
Residue:
1988
  
Inhibitor
Name:
BDBM50395332
Synonyms:
CHEMBL2164390
Type:
Small organic molecule
Emp. Form.:
C24H20F3N3O3
Mol. Mass.:
455.4291
SMILES:
FC(F)(F)Oc1cccc(CNC(=O)C2N(CCc3ccccn3)C(=O)c3ccccc23)c1
: