Target
Potassium voltage-gated channel subfamily KQT member 2
Ligand
BDBM50395486
Substrate
Meas. Tech.
ChEMBL_858528 (CHEMBL2169532)
EC50
170±n/a nM
Citation
 Cheung, YYYu, HXu, KZou, BWu, MMcManus, OBLi, MLindsley, CWHopkins, CR Discovery of a series of 2-phenyl-N-(2-(pyrrolidin-1-yl)phenyl)acetamides as novel molecular switches that modulate modes of K(v)7.2 (KCNQ2) channel pharmacology: identification of (S)-2-phenyl-N-(2-(pyrrolidin-1-yl)phenyl)butanamide (ML252) as a potent, brain penetrant K(v)7.2 channel inhibitor. J Med Chem 55:6975-9 (2012)  
Target
Name:
Potassium voltage-gated channel subfamily KQT member 2
Synonyms:
KCNQ (Kv7) potassium channel KCNQ2_HUMAN Neuroblastoma-specific potassium channel subunit alpha KvLQT2 Voltage-gated potassium channel subunit Kv7.2
Type:
PROTEIN
Mol. Mass.:
95883.20
Organism:
Homo sapiens (Human)
Description:
ChEMBL_1457496
Residue:
872
  
Inhibitor
Name:
BDBM50395486
Synonyms:
CHEMBL2163660
Type:
Small organic molecule
Emp. Form.:
C18H19ClN2O
Mol. Mass.:
314.809
SMILES:
Clc1cccc(CC(=O)Nc2ccccc2N2CCCC2)c1
: