Target
Inhibitor of nuclear factor kappa-B kinase subunit alpha
Ligand
BDBM50350908
Substrate
Meas. Tech.
ChEMBL_858722 (CHEMBL2167033)
IC50
3162.28±n/a nM
Citation
 Liddle, JBamborough, PBarker, MDCampos, SChung, CWCousins, RPFaulder, PHeathcote, MLHobbs, HHolmes, DSIoannou, CRamirez-Molina, CMorse, MAOsborn, RPayne, JJPritchard, JMRumsey, WLTape, DTVicentini, GWhitworth, CWilliamson, RA 4-Phenyl-7-azaindoles as potent, selective and bioavailable IKK2 inhibitors demonstrating good in vivo efficacy. Bioorg Med Chem Lett 22:5222-6 (2012)  
Target
Name:
Inhibitor of nuclear factor kappa-B kinase subunit alpha
Synonyms:
CHUK I-kappa-B kinase 1 IKK-A IKK1 IKKA IkBKA Inhibitor of NF-kappa-B kinase alpha/beta Nuclear factor NF-kappa-B inhibitor kinase alpha TCF16 | Transcription factor 16
Type:
PROTEIN
Mol. Mass.:
84642.21
Organism:
Homo sapiens (Human)
Description:
ChEMBL_327453
Residue:
745
  
Inhibitor
Name:
BDBM50350908
Synonyms:
CHEMBL520308
Type:
Small organic molecule
Emp. Form.:
C17H19N3O3S
Mol. Mass.:
345.416
SMILES:
CN(CCO)S(=O)(=O)c1ccc(cc1)-c1ccnc2[nH]c(C)cc12
: