Target
D(2) dopamine receptor
Ligand
BDBM50395561
Substrate
Meas. Tech.
ChEMBL_859682 (CHEMBL2169117)
Ki
5.9±n/a nM
Citation
 Chen, XSassano, MFZheng, LSetola, VChen, MBai, XFrye, SVWetsel, WCRoth, BLJin, J Structure-functional selectivity relationship studies ofß-arrestin-biased dopamine D2 receptor agonists. J Med Chem 55:7141-53 (2012)  
Target
Name:
D(2) dopamine receptor
Synonyms:
D(2) dopamine receptor DOPAMINE D2 Long DRD2 Dopamine D2 receptor Dopamine D2 receptor (D2R) Dopamine2-like | d2
Type:
Cell-surface receptors
Mol. Mass.:
50647.10
Organism:
Homo sapiens (Human)
Description:
P14416
Residue:
443
  
Inhibitor
Name:
BDBM50395561
Synonyms:
CHEMBL346129
Type:
Small organic molecule
Emp. Form.:
C24H31N3O2
Mol. Mass.:
393.5218
SMILES:
Cc1ccccc1N1CCN(CCCCOc2ccc3CCC(=O)Nc3c2)CC1
: