Target
A disintegrin and metalloproteinase with thrombospondin motifs 4
Ligand
BDBM50395675
Substrate
Meas. Tech.
ChEMBL_860057 (CHEMBL2167993)
IC50
1300±n/a nM
Citation
 Deng, HO'Keefe, HDavie, CPLind, KEAcharya, RAFranklin, GJLarkin, JMatico, RNeeb, MThompson, MMLohr, TGross, JWCentrella, PAO'Donovan, GKBedard, KLvan Vloten, KMataruse, SSkinner, SRBelyanskaya, SLCarpenter, TYShearer, TWClark, MACuozzo, JWArico-Muendel, CCMorgan, BA Discovery of highly potent and selective small molecule ADAMTS-5 inhibitors that inhibit human cartilage degradation via encoded library technology (ELT). J Med Chem 55:7061-79 (2012)  
Target
Name:
A disintegrin and metalloproteinase with thrombospondin motifs 4
Synonyms:
A disintegrin and metalloproteinase with thrombospondin motifs 4 (ADAMTS-4) ATS4_HUMAN KIAA0688 | Metalloproteinase with thrombospondin motifs 4 (ADAMTS-4)
Type:
Enzyme
Mol. Mass.:
90214.54
Organism:
Homo sapiens (Human)
Description:
O75173
Residue:
837
  
Inhibitor
Name:
BDBM50395675
Synonyms:
CHEMBL2164094
Type:
Small organic molecule
Emp. Form.:
C25H37N9O2S
Mol. Mass.:
527.685
SMILES:
CCCNc1nc(NCc2cn(C)cn2)nc(n1)N1CCC[C@@H]1CNS(=O)(=O)c1ccc(CCC)cc1
: