Target
A disintegrin and metalloproteinase with thrombospondin motifs 5
Ligand
BDBM50395705
Substrate
Meas. Tech.
ChEMBL_860056 (CHEMBL2167992)
IC50
4100±n/a nM
Citation
 Deng, HO'Keefe, HDavie, CPLind, KEAcharya, RAFranklin, GJLarkin, JMatico, RNeeb, MThompson, MMLohr, TGross, JWCentrella, PAO'Donovan, GKBedard, KLvan Vloten, KMataruse, SSkinner, SRBelyanskaya, SLCarpenter, TYShearer, TWClark, MACuozzo, JWArico-Muendel, CCMorgan, BA Discovery of highly potent and selective small molecule ADAMTS-5 inhibitors that inhibit human cartilage degradation via encoded library technology (ELT). J Med Chem 55:7061-79 (2012)  
Target
Name:
A disintegrin and metalloproteinase with thrombospondin motifs 5
Synonyms:
A disintegrin and metalloproteinase with thrombospondin motifs 5 (ADAMTS-5) ADAMTS5 ATS5_HUMAN Metalloproteinase with thrombospondin motifs 5 (ADAMTS-5)
Type:
Enzyme
Mol. Mass.:
101769.09
Organism:
Homo sapiens (Human)
Description:
Q9UNA0
Residue:
930
  
Inhibitor
Name:
BDBM50395705
Synonyms:
CHEMBL2164091
Type:
Small organic molecule
Emp. Form.:
C27H36N8O2S2
Mol. Mass.:
568.757
SMILES:
CCCCNc1nc(NCc2cc(cs2)C#N)nc(n1)N1CCC[C@@H]1CNS(=O)(=O)c1ccc(CCC)cc1
: