Target
A disintegrin and metalloproteinase with thrombospondin motifs 5
Ligand
BDBM50395708
Substrate
Meas. Tech.
ChEMBL_860056 (CHEMBL2167992)
IC50
870±n/a nM
Citation
 Deng, HO'Keefe, HDavie, CPLind, KEAcharya, RAFranklin, GJLarkin, JMatico, RNeeb, MThompson, MMLohr, TGross, JWCentrella, PAO'Donovan, GKBedard, KLvan Vloten, KMataruse, SSkinner, SRBelyanskaya, SLCarpenter, TYShearer, TWClark, MACuozzo, JWArico-Muendel, CCMorgan, BA Discovery of highly potent and selective small molecule ADAMTS-5 inhibitors that inhibit human cartilage degradation via encoded library technology (ELT). J Med Chem 55:7061-79 (2012)  
Target
Name:
A disintegrin and metalloproteinase with thrombospondin motifs 5
Synonyms:
A disintegrin and metalloproteinase with thrombospondin motifs 5 (ADAMTS-5) ADAMTS5 ATS5_HUMAN Metalloproteinase with thrombospondin motifs 5 (ADAMTS-5)
Type:
Enzyme
Mol. Mass.:
101769.09
Organism:
Homo sapiens (Human)
Description:
Q9UNA0
Residue:
930
  
Inhibitor
Name:
BDBM50395708
Synonyms:
CHEMBL2164088
Type:
Small organic molecule
Emp. Form.:
C26H30F3N7O2S
Mol. Mass.:
561.622
SMILES:
FC(F)(F)c1ccc(cc1)S(=O)(=O)NC[C@H]1CCCN1c1nc(NCCC=C)nc(NCc2ccccc2)n1
: