Target
Disintegrin and metalloproteinase domain-containing protein 17
Ligand
BDBM50395680
Substrate
Meas. Tech.
ChEMBL_860055 (CHEMBL2167991)
IC50
>50000±n/a nM
Citation
 Deng, HO'Keefe, HDavie, CPLind, KEAcharya, RAFranklin, GJLarkin, JMatico, RNeeb, MThompson, MMLohr, TGross, JWCentrella, PAO'Donovan, GKBedard, KLvan Vloten, KMataruse, SSkinner, SRBelyanskaya, SLCarpenter, TYShearer, TWClark, MACuozzo, JWArico-Muendel, CCMorgan, BA Discovery of highly potent and selective small molecule ADAMTS-5 inhibitors that inhibit human cartilage degradation via encoded library technology (ELT). J Med Chem 55:7061-79 (2012)  
Target
Name:
Disintegrin and metalloproteinase domain-containing protein 17
Synonyms:
ADA17_HUMAN CSVP Disintegrin and metalloproteinase domain-containing protein 17 (ADAM17) TNF-alpha convertase TNF-alpha-converting enzyme (TACE) Tumor necrosis factor-α converting enzyme (TACE)
Type:
Enzyme
Mol. Mass.:
93007.89
Organism:
Homo sapiens (Human)
Description:
Residue:
824
  
Inhibitor
Name:
BDBM50395680
Synonyms:
CHEMBL2164120
Type:
Small organic molecule
Emp. Form.:
C27H29F3N8O2S3
Mol. Mass.:
650.762
SMILES:
FC(F)(F)c1ccc(cc1)S(=O)(=O)NC[C@H]1CCCN1c1nc(NCCC=C)nc(NCc2csc(n2)-c2cccs2)n1
: