Target
Cyclin-dependent kinase 2/G1/S-specific cyclin-E1/G1/S-specific cyclin-E2
Ligand
BDBM7453
Substrate
Meas. Tech.
ChEMBL_858049 (CHEMBL2166785)
Ki
24000±n/a nM
Citation
 Tell, VHolzer, MHerrmann, LMahmoud, KASchächtele, CTotzke, FHilgeroth, A Multitargeted drug development: Discovery and profiling of dihydroxy substituted 1-aza-9-oxafluorenes as lead compounds targeting Alzheimer disease relevant kinases. Bioorg Med Chem Lett 22:6914-8 (2012)  
Target
Name:
Cyclin-dependent kinase 2/G1/S-specific cyclin-E1/G1/S-specific cyclin-E2
Synonyms:
CDK2/Cyclin E/G1/S-specific cyclin E2 Cyclin-dependent kinase 2/cyclin E
Type:
Mol. Mass.:
Description:
ASSAY_ID of EBI is 52510
Components:
This complex has 3 components.
Component 1
Name:
G1/S-specific cyclin-E2
Synonyms:
CCNE2 CDK3/cyclin E | G1/S-specific cyclin-E2
Type:
PROTEIN
Mol. Mass.:
46763.82
Organism:
Homo sapiens (Human)
Description:
EBI_10135
Residue:
404
  
Component 2
Name:
Cyclin-dependent kinase 2
Synonyms:
CDK2 CDK2_HUMAN Cell division protein kinase 2 Protein cereblon/Cyclin-dependent kinase 2 | p33 protein kinase
Type:
Enzyme Subunit
Mol. Mass.:
33938.17
Organism:
Homo sapiens (Human)
Description:
P24941
Residue:
298
  
Component 3
Name:
G1/S-specific cyclin-E1
Synonyms:
CCNE CCNE1_HUMAN
Type:
Enzyme Subunit
Mol. Mass.:
47073.17
Organism:
Homo sapiens (Human)
Description:
Residue:
410
  
Inhibitor
Name:
BDBM7453
Synonyms:
1-aza-9-oxafluorene deriv. 7b elbfluorene analog
Type:
Small organic molecule
Emp. Form.:
C18H13NO3
Mol. Mass.:
291.3007
SMILES:
COc1cnc2oc3ccc(O)cc3c2c1-c1ccccc1
: