Target
Lysine-specific histone demethylase 1A
Ligand
BDBM50396015
Substrate
Meas. Tech.
ChEMBL_861183 (CHEMBL2173251)
Ki
1300±n/a nM
Citation
 Decarlo, DHadden, MK Oncoepigenomics: making histone lysine methylation count. Eur J Med Chem 56:179-194 (2012)  
Target
Name:
Lysine-specific histone demethylase 1A
Synonyms:
AOF2 Flavin-containing amine oxidase domain-containing protein 2 KDM1A KIAA0601 Lysine-specific demethylase 1 (LSD1) Lysine-specific histone demethylase 1 (LSD1)
Type:
Enzyme
Mol. Mass.:
92901.01
Organism:
Homo sapiens (Human)
Description:
O60341
Residue:
852
  
Inhibitor
Name:
BDBM50396015
Synonyms:
CHEMBL2169921
Type:
Small organic molecule
Emp. Form.:
C26H27N3O3
Mol. Mass.:
429.5109
SMILES:
N[C@@H]1C[C@H]1c1ccc(NC(=O)C(Cc2ccccc2)NC(=O)OCc2ccccc2)cc1
: