Target
Histone-lysine N-methyltransferase EHMT2
Ligand
BDBM50396017
Substrate
Meas. Tech.
ChEMBL_861217 (CHEMBL2173355)
IC50
>100000±n/a nM
Citation
 Decarlo, DHadden, MK Oncoepigenomics: making histone lysine methylation count. Eur J Med Chem 56:179-194 (2012)  
Target
Name:
Histone-lysine N-methyltransferase EHMT2
Synonyms:
BAT8 EHMT2 G9A Histone-lysine N-methyltransferase EHMT1/EHMT2 KMT1C Protein G9a (G9a)
Type:
Enzyme
Mol. Mass.:
132339.87
Organism:
Homo sapiens (Human)
Description:
Q96KQ7
Residue:
1210
  
Inhibitor
Name:
BDBM50396017
Synonyms:
CHEMBL2172427
Type:
Small organic molecule
Emp. Form.:
C18H28IN7O5
Mol. Mass.:
549.3633
SMILES:
CNc1ncnc2n(cnc12)[C@@H]1O[C@H](CN(CCI)CCC[C@H](N)C(O)=O)[C@@H](O)[C@H]1O
: