Target
Lysine-specific demethylase 4E
Ligand
BDBM50361475
Substrate
Meas. Tech.
ChEMBL_861179 (CHEMBL2173247)
IC50
5900±n/a nM
Citation
 Decarlo, DHadden, MK Oncoepigenomics: making histone lysine methylation count. Eur J Med Chem 56:179-194 (2012)  
Target
Name:
Lysine-specific demethylase 4E
Synonyms:
2-OG-Dependent Histone Demethylase JMJD2E Jumonji domain-containing protein 2E (JMJD2E) KDM4DL KDM4E_HUMAN Lysine-specific demethylase 4E | Lysine-specific demethylase 4E (KDM4E)
Type:
Enzyme
Mol. Mass.:
56815.71
Organism:
Homo sapiens (Human)
Description:
B2RXH2
Residue:
506
  
Inhibitor
Name:
BDBM50361475
Synonyms:
CHEMBL1938900
Type:
Small organic molecule
Emp. Form.:
C27H29N3O6
Mol. Mass.:
491.5357
SMILES:
ON(CCCCNCc1ccc(COC(=O)Nc2cccc3ccccc23)cc1)C(=O)C=CC(O)=O
: