Target
Histone-lysine N-methyltransferase EHMT1
Ligand
BDBM50396024
Substrate
Meas. Tech.
ChEMBL_861228 (CHEMBL2173366)
Kd
136±n/a nM
Citation
 Decarlo, DHadden, MK Oncoepigenomics: making histone lysine methylation count. Eur J Med Chem 56:179-194 (2012)  
Target
Name:
Histone-lysine N-methyltransferase EHMT1
Synonyms:
EHMT1 EUHMTASE1 Euchromatic histone-lysine N-methyltransferase 1 GLP H3-K9-HMTase 5 Histone-lysine N-methyltransferase EHMT1/EHMT2 KMT1D | Lysine N-methyltransferase 1D
Type:
PROTEIN
Mol. Mass.:
141443.67
Organism:
Homo sapiens (Human)
Description:
ChEMBL_1450367
Residue:
1298
  
Inhibitor
Name:
BDBM50396024
Synonyms:
CHEMBL1232453
Type:
Small organic molecule
Emp. Form.:
C29H52N8O2
Mol. Mass.:
544.7756
SMILES:
COc1cc2c(NC3CCN(CCCCCN)CC3)nc(NCCCN(C)C)nc2cc1OCCCCCN
: