Target
NAD-dependent protein deacetylase sirtuin-1
Ligand
BDBM50396046
Substrate
Meas. Tech.
ChEMBL_861572 (CHEMBL2174513)
EC50
400±n/a nM
Citation
 Blum, CAEllis, JLLoh, CNg, PYPerni, RBStein, RL SIRT1 modulation as a novel approach to the treatment of diseases of aging. J Med Chem 54:417-32 (2011)  
Target
Name:
NAD-dependent protein deacetylase sirtuin-1
Synonyms:
NAD-Dependent Deacetylase Sirtuin-1 NAD-dependent protein deacetylase sirtuin-1 (SIRT1) SIR2-like protein 1 SIRT1 Sirtuin-1 (SIRT1) | hSIR2
Type:
Developmental protein; hydrolase
Mol. Mass.:
81626.66
Organism:
Homo sapiens (Human)
Description:
Residue:
747
  
Inhibitor
Name:
BDBM50396046
Synonyms:
CHEMBL482552
Type:
Small organic molecule
Emp. Form.:
C27H25N7O
Mol. Mass.:
463.5337
SMILES:
O=C(Nc1ccc(CN2CCNCC2)cc1-c1nc2ccccc2[nH]1)c1cnc2ccccc2n1
: