Target
Tyrosine-protein kinase SYK
Ligand
BDBM50325991
Substrate
Meas. Tech.
ChEMBL_861806 (CHEMBL2173399)
EC50
52±n/a nM
Citation
 Singh, RMasuda, ESPayan, DG Discovery and development of spleen tyrosine kinase (SYK) inhibitors. J Med Chem 55:3614-43 (2012)  
Target
Name:
Tyrosine-protein kinase SYK
Synonyms:
KSYK_HUMAN Spleen Tyrosine Kinase Tyrosine-protein kinase SYK (Syk)
Type:
Enzyme
Mol. Mass.:
72079.99
Organism:
Homo sapiens (Human)
Description:
P43405
Residue:
635
  
Inhibitor
Name:
BDBM50325991
Synonyms:
2-(7-(3,4-dimethoxyphenyl)imidazo[1,2-c]pyrimidin-5-ylamino)nicotinamide hydrochloride CHEMBL1242100 | CHEMBL541400
Type:
Small organic molecule
Emp. Form.:
C20H18N6O3
Mol. Mass.:
390.3953
SMILES:
COc1ccc(cc1OC)-c1cc2nccn2c(Nc2ncccc2C(N)=O)n1
: