Target
Tyrosine-protein kinase SYK
Ligand
BDBM7458
Substrate
Meas. Tech.
ChEMBL_861808 (CHEMBL2173401)
EC50
3000±n/a nM
Citation
 Singh, RMasuda, ESPayan, DG Discovery and development of spleen tyrosine kinase (SYK) inhibitors. J Med Chem 55:3614-43 (2012)  
Target
Name:
Tyrosine-protein kinase SYK
Synonyms:
KSYK_HUMAN Spleen Tyrosine Kinase Tyrosine-protein kinase SYK (Syk)
Type:
Enzyme
Mol. Mass.:
72079.99
Organism:
Homo sapiens (Human)
Description:
P43405
Residue:
635
  
Inhibitor
Name:
BDBM7458
Synonyms:
5,7-dihydroxy-2-(4-hydroxyphenyl)-4H-chromen-4-one Apigenin Apigenin (3) Apigenin, 13 Naringenin, 18 US11337935, Compound Apigenin cid_5280443 | jm5b01461, Compound 90
Type:
Small organic molecule
Emp. Form.:
C15H10O5
Mol. Mass.:
270.2369
SMILES:
Oc1ccc(cc1)-c1cc(=O)c2c(O)cc(O)cc2o1
: