Target
Tyrosine-protein kinase SYK
Ligand
BDBM50132437
Substrate
Meas. Tech.
ChEMBL_861813 (CHEMBL2173406)
EC50
>10000±n/a nM
Citation
 Singh, RMasuda, ESPayan, DG Discovery and development of spleen tyrosine kinase (SYK) inhibitors. J Med Chem 55:3614-43 (2012)  
Target
Name:
Tyrosine-protein kinase SYK
Synonyms:
KSYK_RAT | Syk
Type:
PROTEIN
Mol. Mass.:
71541.93
Organism:
Rattus norvegicus
Description:
ChEMBL_1348392
Residue:
629
  
Inhibitor
Name:
BDBM50132437
Synonyms:
3-((1-(3-hydroxypropyl)-5-methoxy-1H-indol-3-yl)methylene)-2-oxoindoline-5-sulfonamide CHEMBL107061
Type:
Small organic molecule
Emp. Form.:
C21H21N3O5S
Mol. Mass.:
427.474
SMILES:
COc1ccc2n(CCCO)cc(\C=C3/C(=O)Nc4ccc(cc34)S(N)(=O)=O)c2c1
: