Target
17-beta-hydroxysteroid dehydrogenase type 1
Ligand
BDBM50396085
Substrate
Meas. Tech.
ChEMBL_861317 (CHEMBL2173705)
IC50
5±n/a nM
Citation
 Spadaro, AFrotscher, MHartmann, RW Optimization of hydroxybenzothiazoles as novel potent and selective inhibitors of 17ß-HSD1. J Med Chem 55:2469-73 (2012)  
Target
Name:
17-beta-hydroxysteroid dehydrogenase type 1
Synonyms:
17-beta-HSD 1 17-beta-hydroxysteroid dehydrogenase type 1 20-alpha-HSD E17KSR EDH17B1 EDHB17 Estradiol 17-beta-dehydrogenase 1 (17beta-HSD1) Placental 17-beta-hydroxysteroid dehydrogenase | SDR28C1
Type:
Enzyme
Mol. Mass.:
34945.13
Organism:
Homo sapiens (Human)
Description:
P14061
Residue:
328
  
Inhibitor
Name:
BDBM50396085
Synonyms:
CHEMBL2170762
Type:
Small organic molecule
Emp. Form.:
C14H8FNO3S
Mol. Mass.:
289.282
SMILES:
Oc1ccc2nc(sc2c1)C(=O)c1cccc(O)c1F
: