Target
Lysosomal acid glucosylceramidase
Ligand
BDBM18428
Substrate
Meas. Tech.
ChEMBL_862807 (CHEMBL2172827)
IC50
2200±n/a nM
Citation
 Patnaik, SZheng, WChoi, JHMotabar, OSouthall, NWestbroek, WLea, WAVelayati, AGoldin, ESidransky, ELeister, WMarugan, JJ Discovery, structure-activity relationship, and biological evaluation of noninhibitory small molecule chaperones of glucocerebrosidase. J Med Chem 55:5734-48 (2012)  
Target
Name:
Lysosomal acid glucosylceramidase
Synonyms:
Acid beta-glucosidase Beta-glucocerebrosidase D-glucosyl-N-acylsphingosine glucohydrolase GBA1 GC GLUC Glucosylceramidase (GBA) Glucosylceramidase precursor (Beta-glucocerebrosidase) (Acid beta-glucosidase) (D-glucosyl-N-acylsphingosine glucohydrolase) (Alglucerase) (Imiglucerase) beta-glucocerebrosidase (GCase)
Type:
Enzyme
Mol. Mass.:
59724.64
Organism:
Homo sapiens (Human)
Description:
The beta-Glu activity was measured with commercially available beta-glucocerebrosidase (Ceredase) as the enzyme source.
Residue:
536
  
Inhibitor
Name:
BDBM18428
Synonyms:
Aminoquinoline compound, 1 NCGC00092410
Type:
Small organic molecule
Emp. Form.:
C21H27N3O2
Mol. Mass.:
353.458
SMILES:
Cc1cc(nc2ccc(NC(=O)C3CCCCC3)cc12)N1CCOCC1
: