Target
Myeloperoxidase
Ligand
BDBM50015089
Substrate
Meas. Tech.
ChEMBL_862117 (CHEMBL2174302)
IC50
3000±n/a nM
Citation
 Aldib, ISoubhye, JZouaoui Boudjeltia, KVanhaeverbeek, MRousseau, AFurtmüller, PGObinger, CDufrasne, FNève, JVan Antwerpen, PPrévost, M Evaluation of new scaffolds of myeloperoxidase inhibitors by rational design combined with high-throughput virtual screening. J Med Chem 55:7208-18 (2012)  
Target
Name:
Myeloperoxidase
Synonyms:
84 kDa myeloperoxidase MPO Myeloperoxidase Myeloperoxidase heavy chain PERM_HUMAN
Type:
Enzyme
Mol. Mass.:
83888.32
Organism:
Homo sapiens (Human)
Description:
P05164
Residue:
745
  
Inhibitor
Name:
BDBM50015089
Synonyms:
2,N-Dihydroxy-benzamide N,2-dihydroxybenzamide Salicylhydroxamic acid (SHA) US11565996, Compound Salicylhydroxamic acid (SHAM)
Type:
Small organic molecule
Emp. Form.:
C7H7NO3
Mol. Mass.:
153.1354
SMILES:
ONC(=O)c1ccccc1O
: