Target
Sodium/hydrogen exchanger 1
Ligand
BDBM50396449
Substrate
Meas. Tech.
ChEMBL_862405 (CHEMBL2173435)
IC50
21±n/a nM
Citation
 Huber, JDBentzien, JBoyer, SJBurke, JDe Lombaert, SEickmeier, CGuo, XHaist, JVHickey, ERKaplita, PKarmazyn, MKemper, RKennedy, CAKirrane, TMadwed, JBMainolfi, ENagaraja, NSoleymanzadeh, FSwinamer, AEldrup, AB Identification of a potent sodium hydrogen exchanger isoform 1 (NHE1) inhibitor with a suitable profile for chronic dosing and demonstrated cardioprotective effects in a preclinical model of myocardial infarction in the rat. J Med Chem 55:7114-40 (2012)  
Target
Name:
Sodium/hydrogen exchanger 1
Synonyms:
APNH NHE-1 Na(+)/H(+) antiporter, amiloride-sensitive SL9A1_HUMAN Solute carrier family 9 member 1
Type:
PROTEIN
Mol. Mass.:
90771.96
Organism:
Homo sapiens (Human)
Description:
ChEMBL_862405
Residue:
815
  
Inhibitor
Name:
BDBM50396449
Synonyms:
CHEMBL2170628
Type:
Small organic molecule
Emp. Form.:
C21H21F3N4O3
Mol. Mass.:
434.4116
SMILES:
NC(=N)NC(=O)c1ccc(C2CCN(CC2)C(=O)c2ccc(O)cc2)c(c1)C(F)(F)F
: