Target
Eukaryotic translation initiation factor 2-alpha kinase 1
Ligand
BDBM50396531
Substrate
Meas. Tech.
ChEMBL_862848 (CHEMBL2172950)
IC50
1863±n/a nM
Citation
 Axten, JMMedina, JRFeng, YShu, ARomeril, SPGrant, SWLi, WHHeerding, DAMinthorn, EMencken, TAtkins, CLiu, QRabindran, SKumar, RHong, XGoetz, AStanley, TTaylor, JDSigethy, SDTomberlin, GHHassell, AMKahler, KMShewchuk, LMGampe, RT Discovery of 7-methyl-5-(1-{[3-(trifluoromethyl)phenyl]acetyl}-2,3-dihydro-1H-indol-5-yl)-7H-pyrrolo[2,3-d]pyrimidin-4-amine (GSK2606414), a potent and selective first-in-class inhibitor of protein kinase R (PKR)-like endoplasmic reticulum kinase (PERK). J Med Chem 55:7193-207 (2012)  
Target
Name:
Eukaryotic translation initiation factor 2-alpha kinase 1
Synonyms:
E2AK1_HUMAN HRI | KIAA1369
Type:
PROTEIN
Mol. Mass.:
71098.55
Organism:
Homo sapiens (Human)
Description:
ChEMBL_1467744
Residue:
630
  
Inhibitor
Name:
BDBM50396531
Synonyms:
CHEMBL2171132
Type:
Small organic molecule
Emp. Form.:
C27H23N5OS
Mol. Mass.:
465.569
SMILES:
Cn1cc(cn1)-c1cnc(N)c2c(csc12)-c1ccc2N(CCc2c1)C(=O)Cc1ccccc1
: