Target
Aldo-keto reductase family 1 member C1
Ligand
BDBM17638
Substrate
Meas. Tech.
ChEMBL_864146 (CHEMBL2175095)
IC50
>100000±n/a nM
Citation
 Jamieson, SMBrooke, DGHeinrich, DAtwell, GJSilva, SHamilton, EJTurnbull, APRigoreau, LJTrivier, ESoudy, CSamlal, SSOwen, PJSchroeder, ERaynham, TFlanagan, JUDenny, WA 3-(3,4-Dihydroisoquinolin-2(1H)-ylsulfonyl)benzoic Acids: highly potent and selective inhibitors of the type 5 17-ß-hydroxysteroid dehydrogenase AKR1C3. J Med Chem 55:7746-58 (2012)  
Target
Name:
Aldo-keto reductase family 1 member C1
Synonyms:
20-alpha-HSD AK1C1_HUMAN Aldo-keto reductase family 1 member C1 (AK1C1) Aldo-keto reductase family 1 member C1 (AKR1C1) DDH High-affinity hepatic bile acid-binding protein | Trans-1,2-dihydrobenzene-1,2-diol dehydrogenase
Type:
Enzyme
Mol. Mass.:
36793.97
Organism:
Homo sapiens (Human)
Description:
Recombinant AKR1C1 enzyme was expressed in E. coli.
Residue:
323
  
Inhibitor
Name:
BDBM17638
Synonyms:
2-{1-[(4-chlorophenyl)carbonyl]-5-methoxy-2-methyl-1H-indol-3-yl}acetic acid Indocin US11478464, Compound Indomethacin US9271961, Indomethacin | indometacin
Type:
Small organic molecule
Emp. Form.:
C19H16ClNO4
Mol. Mass.:
357.788
SMILES:
COc1ccc2n(C(=O)c3ccc(Cl)cc3)c(C)c(CC(O)=O)c2c1
: