Target
cAMP-specific 3',5'-cyclic phosphodiesterase 4D
Ligand
BDBM14361
Substrate
Meas. Tech.
ChEMBL_864908 (CHEMBL2175751)
IC50
622±n/a nM
Citation
 Kümmerle, AESchmitt, MCardozo, SVLugnier, CVilla, PLopes, ABRomeiro, NCJustiniano, HMartins, MAFraga, CABourguignon, JJBarreiro, EJ Design, synthesis, and pharmacological evaluation of N-acylhydrazones and novel conformationally constrained compounds as selective and potent orally active phosphodiesterase-4 inhibitors. J Med Chem 55:7525-45 (2012)  
Target
Name:
cAMP-specific 3',5'-cyclic phosphodiesterase 4D
Synonyms:
3',5'-cyclic phosphodiesterase PDE43 PDE4D_HUMAN | Phosphodiesterase 4D
Type:
Protein
Mol. Mass.:
91092.69
Organism:
Homo sapiens (Human)
Description:
Q08499
Residue:
809
  
Inhibitor
Name:
BDBM14361
Synonyms:
(R,S)-Rolipram 4-[3-(cyclopentyloxy)-4-methoxyphenyl]pyrrolidin-2-one CHEMBL63 | Rolipram
Type:
Small organic molecule
Emp. Form.:
C16H21NO3
Mol. Mass.:
275.3428
SMILES:
COc1ccc(cc1OC1CCCC1)C1CNC(=O)C1
: