Target
cAMP-specific 3',5'-cyclic phosphodiesterase 4A
Ligand
BDBM14361
Substrate
Meas. Tech.
ChEMBL_864912 (CHEMBL2175862)
IC50
162±n/a nM
Citation
 Kümmerle, AESchmitt, MCardozo, SVLugnier, CVilla, PLopes, ABRomeiro, NCJustiniano, HMartins, MAFraga, CABourguignon, JJBarreiro, EJ Design, synthesis, and pharmacological evaluation of N-acylhydrazones and novel conformationally constrained compounds as selective and potent orally active phosphodiesterase-4 inhibitors. J Med Chem 55:7525-45 (2012)  
Target
Name:
cAMP-specific 3',5'-cyclic phosphodiesterase 4A
Synonyms:
3',5'-cyclic phosphodiesterase PDE46 PDE4A_HUMAN Phosphodiesterase 4A | Phosphodiesterase 4A (PDE4)
Type:
Enzyme
Mol. Mass.:
98113.27
Organism:
Homo sapiens (Human)
Description:
P27815
Residue:
886
  
Inhibitor
Name:
BDBM14361
Synonyms:
(R,S)-Rolipram 4-[3-(cyclopentyloxy)-4-methoxyphenyl]pyrrolidin-2-one CHEMBL63 | Rolipram
Type:
Small organic molecule
Emp. Form.:
C16H21NO3
Mol. Mass.:
275.3428
SMILES:
COc1ccc(cc1OC1CCCC1)C1CNC(=O)C1
: