Target
Thermolysin
Ligand
BDBM50396787
Substrate
Meas. Tech.
ChEMBL_864915 (CHEMBL2175865)
Ki
472±n/a nM
Citation
 Nasief, NNTan, HKong, JHangauer, D Water mediated ligand functional group cooperativity: the contribution of a methyl group to binding affinity is enhanced by a COO(-) group through changes in the structure and thermodynamics of the hydration waters of ligand-thermolysin complexes. J Med Chem 55:8283-302 (2012)  
Target
Name:
Thermolysin
Synonyms:
THER_BACTH | npr
Type:
PROTEIN
Mol. Mass.:
60097.54
Organism:
Bacillus thermoproteolyticus
Description:
ChEMBL_1468794
Residue:
548
  
Inhibitor
Name:
BDBM50396787
Synonyms:
CHEMBL2172737
Type:
Small organic molecule
Emp. Form.:
C17H24N3O7P
Mol. Mass.:
413.3632
SMILES:
CC(C)C[C@H](NP([O-])(=O)CNC(=O)OCc1ccccc1)C(=O)NCC([O-])=O
: