Target
Carbonic anhydrase 12
Ligand
BDBM50146799
Substrate
Meas. Tech.
ChEMBL_861926 (CHEMBL2173730)
IC50
7270±n/a nM
Citation
 Reich, RHoffman, AVeerendhar, AMaresca, AInnocenti, ASupuran, CTBreuer, E Carbamoylphosphonates control tumor cell proliferation and dissemination by simultaneously inhibiting carbonic anhydrase IX and matrix metalloproteinase-2. Toward nontoxic chemotherapy targeting tumor microenvironment. J Med Chem 55:7875-82 (2012)  
Target
Name:
Carbonic anhydrase 12
Synonyms:
CA-XII CAH12_HUMAN Carbonic anhydrase Carbonic anhydrase XII Carbonic anhydrase XII (CAXII) | Tumor antigen HOM-RCC-3.1.3
Type:
Enzyme
Mol. Mass.:
39456.00
Organism:
Homo sapiens (Human)
Description:
Catalytic domain of human cloned isozyme was used in the assay
Residue:
354
  
Inhibitor
Name:
BDBM50146799
Synonyms:
(isopropylamino)carbonylphosphonic acid | CHEMBL97034
Type:
Small organic molecule
Emp. Form.:
C4H10NO4P
Mol. Mass.:
167.1003
SMILES:
CC(C)NC(=O)P(O)(O)=O
: