Target
Carbonic anhydrase 9
Ligand
BDBM50146799
Substrate
Meas. Tech.
ChEMBL_861925 (CHEMBL2173729)
IC50
8300±n/a nM
Citation
 Reich, RHoffman, AVeerendhar, AMaresca, AInnocenti, ASupuran, CTBreuer, E Carbamoylphosphonates control tumor cell proliferation and dissemination by simultaneously inhibiting carbonic anhydrase IX and matrix metalloproteinase-2. Toward nontoxic chemotherapy targeting tumor microenvironment. J Med Chem 55:7875-82 (2012)  
Target
Name:
Carbonic anhydrase 9
Synonyms:
CA-IX CAH9_HUMAN Carbonic anhydrase 9 (CA IX) Carbonic anhydrase 9 precursor Carbonic anhydrase IX (CAIX) Carbonic anhydrases; II & IX MN RCC-associated antigen G250
Type:
Enzyme
Mol. Mass.:
49669.03
Organism:
Homo sapiens (Human)
Description:
Catalytic domain of human cloned isozyme was used in the assay
Residue:
459
  
Inhibitor
Name:
BDBM50146799
Synonyms:
(isopropylamino)carbonylphosphonic acid | CHEMBL97034
Type:
Small organic molecule
Emp. Form.:
C4H10NO4P
Mol. Mass.:
167.1003
SMILES:
CC(C)NC(=O)P(O)(O)=O
: