Target
72 kDa type IV collagenase
Ligand
BDBM50146799
Substrate
Meas. Tech.
ChEMBL_861930 (CHEMBL2173734)
IC50
1000±n/a nM
Citation
 Reich, RHoffman, AVeerendhar, AMaresca, AInnocenti, ASupuran, CTBreuer, E Carbamoylphosphonates control tumor cell proliferation and dissemination by simultaneously inhibiting carbonic anhydrase IX and matrix metalloproteinase-2. Toward nontoxic chemotherapy targeting tumor microenvironment. J Med Chem 55:7875-82 (2012)  
Target
Name:
72 kDa type IV collagenase
Synonyms:
72 kDa gelatinase CLG4A Gelatinase A (MMP-2) MMP2_HUMAN Matrix metalloproteinase-2 (MMP 2) Matrix metalloproteinases 2 (MMP-2) | TBE-1
Type:
Enzyme
Mol. Mass.:
73870.36
Organism:
Homo sapiens (Human)
Description:
P08253
Residue:
660
  
Inhibitor
Name:
BDBM50146799
Synonyms:
(isopropylamino)carbonylphosphonic acid | CHEMBL97034
Type:
Small organic molecule
Emp. Form.:
C4H10NO4P
Mol. Mass.:
167.1003
SMILES:
CC(C)NC(=O)P(O)(O)=O
: