Target
Serine/threonine-protein kinase mTOR
Ligand
BDBM50396818
Substrate
Meas. Tech.
ChEMBL_861945 (CHEMBL2173749)
IC50
>10000±n/a nM
Citation
 Norman, MHAndrews, KLBo, YYBooker, SKCaenepeel, SCee, VJD'Angelo, NDFreeman, DJHerberich, BJHong, FTJackson, CLJiang, JLanman, BALiu, LMcCarter, JDMullady, ELNishimura, NPettus, LHReed, ABMiguel, TSSmith, ALStec, MMTadesse, STasker, AAidasani, DZhu, XSubramanian, RTamayo, NAWang, LWhittington, DAWu, BWu, TWurz, RPYang, KZalameda, LZhang, NHughes, PE Selective class I phosphoinositide 3-kinase inhibitors: optimization of a series of pyridyltriazines leading to the identification of a clinical candidate, AMG 511. J Med Chem 55:7796-816 (2012)  
Target
Name:
Serine/threonine-protein kinase mTOR
Synonyms:
FK506-binding protein 12-rapamycin complex-associated protein 1 FRAP FRAP1 MTOR Mammalian Target of Rapamycin (mTOR) RAFT1 Rapamycin and FKBP12 target 1 Serine/threonine-protein kinase (mTOR) | mTORC2
Type:
Rapamycin target protein
Mol. Mass.:
288917.12
Organism:
Homo sapiens (Human)
Description:
P42345
Residue:
2549
  
Inhibitor
Name:
BDBM50396818
Synonyms:
CHEMBL2170090 | US8772480, 280
Type:
Small organic molecule
Emp. Form.:
C23H30FN9O3S
Mol. Mass.:
531.606
SMILES:
COc1ncc(Nc2ncc(cc2-c2nc(C)nc(N)n2)C(C)(C)N2CCN(CC2)S(C)(=O)=O)cc1F
: