Target
Prostaglandin G/H synthase 2
Ligand
BDBM50396892
Substrate
Meas. Tech.
ChEMBL_862693 (CHEMBL2174241)
IC50
>400000±n/a nM
Citation
 Arisawa, MKasaya, YObata, TSasaki, TNakamura, TAraki, TYamamoto, KSasaki, AYamano, AIto, MAbe, HIto, YShuto, S Design and synthesis of indomethacin analogues that inhibit P-glycoprotein and/or multidrug resistant protein without COX inhibitory activity. J Med Chem 55:8152-63 (2012)  
Target
Name:
Prostaglandin G/H synthase 2
Synonyms:
COX2 Cyclooxygenase-2 (COX-2) PTGS2 Prostaglandin G/H synthase (cyclooxygenase)
Type:
Protein
Mol. Mass.:
68976.98
Organism:
Ovis aries (Sheep)
Description:
Residue:
603
  
Inhibitor
Name:
BDBM50396892
Synonyms:
CHEMBL2170688
Type:
Small organic molecule
Emp. Form.:
C19H16ClNO3
Mol. Mass.:
341.788
SMILES:
CCc1cccc2c(CC(O)=O)cn(C(=O)c3ccc(Cl)cc3)c12
: