Target
Cathepsin K
Ligand
BDBM50390404
Substrate
Meas. Tech.
ChEMBL_864178 (CHEMBL2175127)
IC50
15±n/a nM
Citation
 Crawford, JJKenny, PWBowyer, JCook, CRFinlayson, JEHeyes, CHighton, AJHudson, JAJestel, AKrapp, SMartin, SMacfaul, PAMcDermott, BPMcGuire, TMMorley, ADMorris, JJPage, KMRibeiro, LRSawney, HSteinbacher, SSmith, CDossetter, AG Pharmacokinetic benefits of 3,4-dimethoxy substitution of a phenyl ring and design of isosteres yielding orally available cathepsin K inhibitors. J Med Chem 55:8827-37 (2012)  
Target
Name:
Cathepsin K
Synonyms:
CATK_HUMAN CTSO Cathepsin O Cathepsin X
Type:
Enzyme
Mol. Mass.:
36975.68
Organism:
Homo sapiens (Human)
Description:
P43235
Residue:
329
  
Inhibitor
Name:
BDBM50390404
Synonyms:
CHEMBL2070936
Type:
Small organic molecule
Emp. Form.:
C22H27FN4O2
Mol. Mass.:
398.4738
SMILES:
Fc1ccc(cc1)N1CCN(CC1)C(=O)[C@@H]1CCCC[C@H]1C(=O)NC1(CC1)C#N
: