Target
Oxytocin receptor
Ligand
BDBM35714
Substrate
Meas. Tech.
ChEMBL_864207 (CHEMBL2175259)
Ki
660±n/a nM
Citation
 Loison, SCottet, MOrcel, HAdihou, HRahmeh, RLamarque, LTrinquet, EKellenberger, EHibert, MDurroux, TMouillac, BBonnet, D Selective fluorescent nonpeptidic antagonists for vasopressin V2 GPCR: application to ligand screening and oligomerization assays. J Med Chem 55:8588-602 (2012)  
Target
Name:
Oxytocin receptor
Synonyms:
OT-R OXYR_HUMAN | Oxytocin
Type:
Enzyme Catalytic Domain
Mol. Mass.:
42793.26
Organism:
Homo sapiens (Human)
Description:
Oxytocin OXTR HEK293::B2R9L7
Residue:
389
  
Inhibitor
Name:
BDBM35714
Synonyms:
CHEMBL420762 N-[4-(5-Dimethylamino-2,3,4,5-tetrahydro-benzo[b]azepine-1-carbonyl)-phenyl]-2-methyl-benzamide | OPC-31260
Type:
Small organic molecule
Emp. Form.:
C27H29N3O2
Mol. Mass.:
427.5381
SMILES:
CN(C)C1CCCN(C(=O)c2ccc(NC(=O)c3ccccc3C)cc2)c2ccccc12
: