Target
Muscarinic acetylcholine receptor M1
Ligand
BDBM50397220
Substrate
Meas. Tech.
ChEMBL_864188 (CHEMBL2175240)
Ki
>1000±n/a nM
Citation
 Loison, SCottet, MOrcel, HAdihou, HRahmeh, RLamarque, LTrinquet, EKellenberger, EHibert, MDurroux, TMouillac, BBonnet, D Selective fluorescent nonpeptidic antagonists for vasopressin V2 GPCR: application to ligand screening and oligomerization assays. J Med Chem 55:8588-602 (2012)  
Target
Name:
Muscarinic acetylcholine receptor M1
Synonyms:
ACM1_HUMAN Cholinergic receptor, muscarinic 1 | Cholinergic, muscarinic M1
Type:
Protein
Mol. Mass.:
51442.54
Organism:
Homo sapiens (Human)
Description:
P11229
Residue:
460
  
Inhibitor
Name:
BDBM50397220
Synonyms:
CHEMBL2172286
Type:
Small organic molecule
Emp. Form.:
C36H37BF2N8O3S
Mol. Mass.:
710.604
SMILES:
F[B-]1(F)n2c(CC3C=CC(CCC(=O)NCCN4CCN(CC(=O)N5c6ccccc6C(=O)Nc6cccnc56)CC4)=[N+]13)ccc2-c1cccs1
: