Target
Tyrosyl-DNA phosphodiesterase 1
Ligand
BDBM50397325
Substrate
Meas. Tech.
ChEMBL_864727 (CHEMBL2174994)
IC50
111000±n/a nM
Citation
 Sirivolu, VRVernekar, SKMarchand, CNaumova, AChergui, ARenaud, AStephen, AGChen, FSham, YYPommier, YWang, Z 5-Arylidenethioxothiazolidinones as inhibitors of tyrosyl-DNA phosphodiesterase I. J Med Chem 55:8671-84 (2012)  
Target
Name:
Tyrosyl-DNA phosphodiesterase 1
Synonyms:
TDP1 Tyrosyl-DNA phosphodiesterase 1 | Tyrosyl-DNA phosphodiesterase 1 (TDP1)
Type:
Enzyme
Mol. Mass.:
68430.66
Organism:
Homo sapiens (Human)
Description:
Q9NUW8
Residue:
608
  
Inhibitor
Name:
BDBM50397325
Synonyms:
CHEMBL2170164
Type:
Small organic molecule
Emp. Form.:
C17H13FN2OS
Mol. Mass.:
312.361
SMILES:
Fc1ccc(\C=C2/N(Cc3ccccc3)C(=S)NC2=O)cc1
: