Target
Tyrosyl-DNA phosphodiesterase 1
Ligand
BDBM50397315
Substrate
Meas. Tech.
ChEMBL_864728 (CHEMBL2174995)
IC50
76000±n/a nM
Citation
 Sirivolu, VRVernekar, SKMarchand, CNaumova, AChergui, ARenaud, AStephen, AGChen, FSham, YYPommier, YWang, Z 5-Arylidenethioxothiazolidinones as inhibitors of tyrosyl-DNA phosphodiesterase I. J Med Chem 55:8671-84 (2012)  
Target
Name:
Tyrosyl-DNA phosphodiesterase 1
Synonyms:
TDP1 Tyrosyl-DNA phosphodiesterase 1 | Tyrosyl-DNA phosphodiesterase 1 (TDP1)
Type:
Enzyme
Mol. Mass.:
68430.66
Organism:
Homo sapiens (Human)
Description:
Q9NUW8
Residue:
608
  
Inhibitor
Name:
BDBM50397315
Synonyms:
CHEMBL2170126
Type:
Small organic molecule
Emp. Form.:
C10H7NO3S2
Mol. Mass.:
253.297
SMILES:
OC1=NC(=S)C(S1)=Cc1cc(O)ccc1O
: