Target
Histone deacetylase 8
Ligand
BDBM19149
Substrate
Meas. Tech.
ChEMBL_864759 (CHEMBL2175141)
IC50
440±n/a nM
Citation
 Vaidya, ASNeelarapu, RMadriaga, ABai, HMendonca, EAbdelkarim, Hvan Breemen, RBBlond, SYPetukhov, PA Novel histone deacetylase 8 ligands without a zinc chelating group: exploring an 'upside-down' binding pose. Bioorg Med Chem Lett 22:6621-7 (2012)  
Target
Name:
Histone deacetylase 8
Synonyms:
HD8 HDAC8_HUMAN Histone deacetylase 8 (HDAC-8) | Human HDAC8
Type:
Enzyme
Mol. Mass.:
41749.60
Organism:
Homo sapiens (Human)
Description:
Q9BY41
Residue:
377
  
Inhibitor
Name:
BDBM19149
Synonyms:
CHEMBL98 SAHA US10188756, Compound SAHA US11505523, Compound SAHA US9353061, SAHA US9695181, Vorinostat Zolinza suberoylanilide hydroxamic acid
Type:
Small organic molecule
Emp. Form.:
C14H20N2O3
Mol. Mass.:
264.3202
SMILES:
ONC(=O)CCCCCCC(=O)Nc1ccccc1
: