Target
Cannabinoid receptor 2
Ligand
BDBM50397387
Substrate
Meas. Tech.
ChEMBL_864944 (CHEMBL2175894)
Ki
0.28±n/a nM
Citation
 El Bakali, JGilleron, PBody-Malapel, MMansouri, RMuccioli, GGDjouina, MBarczyk, AKlupsch, FAndrzejak, VLipka, EFurman, CLambert, DMChavatte, PDesreumaux, PMillet, R 4-Oxo-1,4-dihydropyridines as selective CB2 cannabinoid receptor ligands. Part 2: discovery of new agonists endowed with protective effect against experimental colitis. J Med Chem 55:8948-52 (2012)  
Target
Name:
Cannabinoid receptor 2
Synonyms:
CANNABINOID CB2 CB2 CB2B CNR2_HUMAN Cannabinoid CB2 receptor Cannabinoid receptor 2 (CB2R) | hCB2
Type:
G Protein-Coupled Receptor (GPCR)
Mol. Mass.:
39690.94
Organism:
Homo sapiens (Human)
Description:
P34972
Residue:
360
  
Inhibitor
Name:
BDBM50397387
Synonyms:
CHEMBL2170532
Type:
Small organic molecule
Emp. Form.:
C21H27F3N2O2
Mol. Mass.:
396.4465
SMILES:
Cc1cc(=O)c(cn1CCCC(F)(F)F)C(=O)NC12CC3CC(CC(C3)C1)C2
: