Target
Apoptosis regulator Bcl-2
Ligand
BDBM50397475
Substrate
Meas. Tech.
ChEMBL_862011 (CHEMBL2173961)
Ki
178±n/a nM
Citation
 Chen, JZhou, HAguilar, ALiu, LBai, LMcEachern, DYang, CYMeagher, JLStuckey, JAWang, S Structure-based discovery of BM-957 as a potent small-molecule inhibitor of Bcl-2 and Bcl-xL capable of achieving complete tumor regression. J Med Chem 55:8502-14 (2012)  
Target
Name:
Apoptosis regulator Bcl-2
Synonyms:
Apoptosis regulator Bcl-2 Protein BCL-2 BCL2_HUMAN | Bcl-2 Protein
Type:
Homodimer or heterodimer
Mol. Mass.:
26269.11
Organism:
Homo sapiens (Human)
Description:
P10415
Residue:
239
  
Inhibitor
Name:
BDBM50397475
Synonyms:
CHEMBL2171007
Type:
Small organic molecule
Emp. Form.:
C44H52ClN7O3S
Mol. Mass.:
794.447
SMILES:
CN1CCN(CCCNC(=O)c2c(C)n(C)c(c2-c2cccc(c2)N2CCN(CC2)c2ccc(NS(=O)(=O)c3cccc(C)c3)cc2)-c2ccc(Cl)cc2)CC1
: